{"text_format":"1","workbook":"xlsx","n_sheets":11,"sheets":["Instructions","Rate Application","Description_Notes","Information","Equipment list","Expense Detail","Salary Operating and Deprec Exp","Rate Summary","Rate Sheet","Index Summary","Reviewer Notes"],"not_rendered":{"charts":0,"images":0,"macros":1,"external_links":1,"defined_names":18,"comments":1,"pivot_tables":1},"unopened":[],"bounds":{"document_bytes":16777216,"sheet_cells":100000,"rows_first":2000,"rows_last":500,"rows_between":2000,"halvings":0,"cell_chars":16384,"cell_head_chars":4096},"cells_cut":0,"cells_raw":0,"read":"whole","date_system":"1900"}

{"sheet":"Instructions","index":0,"n_rows":26,"n_cols":4,"rows_kept":26,"cut":false,"hidden":false,"merged":[[21,0,21,3],[24,0,24,1],[25,0,25,1],[26,0,26,1],[0,0,0,4],[1,0,1,4],[3,0,3,4],[10,0,10,4],[20,0,20,4]]}
["Service Center Rate Development Worksheet"]
["University of Idaho"]
[]
["General Information:"]
[]
[]
[]
[]
[]
[]
["Sheets and purposes:"]
[]
[]
[]
[]
[]
[]
[]
[]
[]
{"$rows_left_out":7}
{"sheet":"Rate Application","index":1,"n_rows":36,"n_cols":12,"rows_kept":36,"cut":false,"hidden":false,"merged":[[5,4,5,11],[35,2,35,6],[35,8,35,11],[31,6,31,7],[31,8,31,9],[31,10,31,11],[33,1,33,10],[34,1,34,2],[34,3,34,6],[34,8,34,11],[24,1,24,10],[25,1,25,11],[27,3,27,4],[13,1,13,9],[13,10,13,11],[14,1,14,9],[14,10,14,11],[15,1,15,9],[15,10,15,11],[19,1,19,4],[27,1,27,2],[16,1,16,11],[17,1,17,11],[20,1,20,11],[21,1,21,11],[10,1,10,3],[10,4,10,6],[10,7,10,9],[10,10,10,11],[11,1,11,3],[11,4,11,6],[11,7,11,9],[11,10,11,11],[1,1,1,2],[9,1,9,3],[9,4,9,6],[9,7,9,9],[9,10,9,11],[3,1,3,3],[3,4,3,11],[4,1,4,3],[4,4,4,11],[6,1,6,3],[6,4,6,11],[8,1,8,3],[8,4,8,6],[8,7,8,9],[1,7,1,8],[5,1,5,3]]}
[null,"Service Center Rate Application",null,null,null,null,null,null,null,null,null,"FY2024"]
[null,"For rates effective:",null,null,null,null,null,"Application Type:",null,null," New","Renewal"]
[]
[null,"College/Division"]
[null,"Department"]
[null,"Service Center Name"]
[null,"Service Center Location"]
[]
[null,"Contact Information:",null,null,"Name",null,null,"Email",null,null,"Phone #"]
[null,"Worksheet preparer"]
[null,"College Fiscal Contact"]
[null,"Service Center Manager"]
[]
[null,"What % of total revenue is charged to internal UI Departments (including your own)?"]
[null,"What % of the above internal revenue is charged to Sponsored Projects (\"22\" funds)?"]
[null,"What % of total revenue is charged to external (non-UI) customers? *"]
[null,"Description of the product(s) or service(s) provided:"]
[]
[]
[null,"Do competitors exist outside of the UI?",null,null,null,null,"Yes","No"]
{"$rows_left_out":17}
{"sheet":"Description_Notes","index":2,"n_rows":27,"n_cols":3,"rows_kept":27,"cut":false,"hidden":false,"merged":[[8,0,23,4],[27,0,41,4]]}
["Department Notes and Comments"]
[]
[]
[]
[]
[]
[]
["Notes about your service center"," "," "]
[" "]
[]
[]
[]
[]
[]
[]
[]
[]
[]
[]
[]
{"$rows_left_out":8}
{"sheet":"Information","index":3,"n_rows":41,"n_cols":10,"rows_kept":41,"cut":false,"hidden":false,"merged":[[37,2,37,4],[38,2,38,4],[39,2,39,4],[40,2,40,4],[27,2,27,4],[36,2,36,4],[30,2,30,4],[10,1,10,2],[11,1,11,2],[12,1,12,2],[13,1,13,2],[14,1,14,2],[4,1,4,3],[2,4,2,5],[8,1,8,2],[9,1,9,2],[6,3,6,5],[8,3,8,5],[9,3,9,5],[7,1,7,2],[7,3,7,5],[10,3,10,5],[11,3,11,5],[26,2,26,4],[20,5,20,9],[19,5,19,9],[16,3,16,5],[12,3,12,5],[13,3,13,5],[14,3,14,5],[15,3,15,5],[15,1,15,2],[16,1,16,2],[24,2,24,4],[25,2,25,4],[22,2,22,4],[23,2,23,4]]}
["Index Information",null,null,null,null,null,null,null,null,{"$f":"'Rate Application'!L1","v":"FY2024"}]
[]
[null,"Service Center Name *",null,null,{"$f":"IF('Rate Application'!E6=0,\"Please fill in cell E6 on rate application page\",'Rate Application'!E6)","v":"Please fill in cell E6 on rate application page"}]
[null,"Index/Fund # **"]
[null,"Operating Index Carry Forward ***",null,null,null,{"$f":"J29","v":0}]
[]
[null,"Service Name (short)",null,"Brief description of service",null,null,"Current Rate\n(if applicable)","Unit †","Estimated # of annual units ‡","Proposed New Rate  "]
["1)",null,null,null,null,null,null,null,null,{"$f":"'Rate Summary'!B31","v":0}]
["2)",null,null,null,null,null,null,null,null,{"$f":"'Rate Summary'!C31","v":0}]
["3)",null,null,null,null,null,null,null,null,{"$f":"'Rate Summary'!D31","v":0}]
["4)",null,null,null,null,null,null,null,null,{"$f":"'Rate Summary'!E31","v":0}]
["5)",null,null,null,null,null,null,null,null,{"$f":"'Rate Summary'!F31","v":0}]
["6)",null,null,null,null,null,null,null,null,{"$f":"'Rate Summary'!G31","v":0}]
["7)",null,null,null,null,null,null,null,null,{"$f":"'Rate Summary'!H31","v":0}]
["8)",null,null,null,null,null,null,null,null,{"$f":"'Rate Summary'!I31","v":0}]
["9)",null,null,null,null,null,null,null,null,{"$f":"'Rate Summary'!J31","v":0}]
["10)",null,null,null,null,null,null,null,null,{"$f":"'Rate Summary'!K31","v":0}]
[]
["FUND BALANCE AND SUBSIDY INDEX INFORMATION:"]
[]
{"$rows_left_out":22}
{"sheet":"Equipment list","index":4,"n_rows":0,"n_cols":0,"rows_kept":0,"cut":false,"hidden":false,"merged":[]}

{"sheet":"Expense Detail","index":5,"n_rows":7,"n_cols":50,"rows_kept":7,"cut":false,"hidden":false,"merged":[]}
["Fiscal Year","Fiscal Period","Activity Date","Chart","Document Code","Document Reference","Vendor Name","Encumbrance Number","Transaction Description","Transaction Date","Transaction Type","Grant Code","Fund Type","Fund Type Title","Fund Level 3","Fund Title 3","Fund Level 4","Fund Title 4","Fund Level 5","Fund Title 5","Fund Predecessor","Fund Predecessor Title","Fund","Fund Title","Level 3 Org","Level 3 Org Title","Index Code","Index Title","Organization","Organization Title","PE","PE Title","Account","Account Title","Program","Program Title","Activity","Activity Code Title","Location Code","Location Title","Dr Cr","Original Budget","Adjusted Budget","YTD","Encumbrance"]
[]
[]
[]
[null,null,null,null,null,null,null,null,null,null,null,null,null,null,null,null,null,null,null,null,null,null,null,null,null,null,null,null,null,null,null,null,null,null,null,null,null,null,null,null,null,null,null,null,null,null,null,"Account","Account Title","Sum of YTD"]
[null,null,null,null,null,null,null,null,null,null,null,null,null,null,null,null,null,null,null,null,null,null,null,null,null,null,null,null,null,null,null,null,null,null,null,null,null,null,null,null,null,null,null,null,null,null,null,"(blank)","(blank)"]
[null,null,null,null,null,null,null,null,null,null,null,null,null,null,null,null,null,null,null,null,null,null,null,null,null,null,null,null,null,null,null,null,null,null,null,null,null,null,null,null,null,null,null,null,null,null,null,"Grand Total"]

{"sheet":"Salary Operating and Deprec Exp","index":6,"n_rows":255,"n_cols":35,"rows_kept":255,"cut":false,"hidden":false,"merged":[[0,9,1,9],[0,10,1,10],[135,29,135,30],[135,31,135,32],[135,33,135,34],[0,11,1,11],[0,12,1,12],[52,10,52,11],[134,33,134,34],[134,29,134,30],[134,31,134,32],[135,27,135,28],[135,9,135,10],[135,11,135,12],[135,13,135,14],[135,15,135,16],[134,21,134,22],[134,23,134,24],[134,25,134,26],[134,27,134,28],[135,17,135,18],[135,19,135,20],[135,21,135,22],[135,23,135,24],[135,25,135,26],[53,18,53,19],[134,9,134,10],[134,11,134,12],[134,13,134,14],[134,15,134,16],[134,17,134,18],[134,19,134,20],[52,20,52,21],[53,22,53,23],[53,24,53,25],[52,2,52,3],[52,4,52,5],[52,6,52,7],[52,8,52,9],[53,20,53,21],[53,2,53,3],[53,4,53,5],[53,6,53,7],[53,8,53,9],[53,10,53,11],[53,12,53,13],[53,14,53,15],[53,16,53,17],[52,22,52,23],[52,24,52,25],[7,8,7,9],[7,10,7,11],[8,8,8,9],[8,10,8,11],[7,16,7,17],[7,18,7,19],[8,16,8,17],[8,18,8,19],[7,24,7,25],[8,24,8,25],[52,12,52,13],[52,14,52,15],[52,16,52,17],[52,18,52,19],[7,32,7,33],[8,32,8,33],[7,12,7,13],[7,14,7,15],[8,12,8,13],[8,14,8,15],[7,28,7,29],[8,28,8,29],[7,20,7,21],[7,22,7,23],[8,20,8,21],[8,22,8,23],[7,30,7,31],[8,30,8,31],[7,26,7,27],[8,26,8,27]]}
[{"$f":"'Rate Application'!L1","v":"FY2024"},null,null,null,null,null,{"$f":"RIGHT(A1,4)-1","v":2023},null,null,"** Employee Type:","Employee Class","Description:","Fringe Rate:"]
[{"$f":"IFERROR('[1]Rate Application'!E6:L6,\"\")","v":""}]
[null,null,null,null,null,null,null,null,null,"Faculty \n","F1, F2, F3, F6, F7, F8, FC, SS","All faculty",0.31]
[null,null,null,null,null,null,null,null,null,"Staff\n","AC, C1, C2, C3, CM, E1, E2, E3, EC, P1, P2, P3, T1","Classified, Exempt & TH",0.41299999999999998]
["Salaries and Fringe Benefits",null,null,null,null,null,null,null,null,"Student\n","GA, SF, SI, ST","All other employee types",2.5000000000000001E-2]
["For instructions on obtaining salary information, please see additional instructions provided on the Instructions page of this workbook",null,null,null,null,null,null,null,null,"Temp/IH\n","E4, F4, F9, P4, T4, T5","Non-student: Temp/ Irregular Help",8.3000000000000004E-2]
[]
["Additional are hidden (rows 16-41). Unhide them if additional rows are needed.",null,null,null,null,null,null,null,{"$f":"Information!B8","v":0},null,{"$f":"Information!B9","v":0},null,{"$f":"Information!B10","v":0},null,{"$f":"Information!B11","v":0},null,{"$f":"Information!B12","v":0},null,{"$f":"Information!B13","v":0},null,{"$f":"Information!B14","v":0},null,{"$f":"Information!B15","v":0},null,{"$f":"Information!B16","v":0},null,{"$f":"Information!B17","v":0},null,"Subsidy",null,"Non-service center ",null,"Check totals *"]
[null,null,null,null,null,null," ",null,{"$f":"Information!D8","v":0},null,{"$f":"Information!D9","v":0},null,{"$f":"Information!D10","v":0},null,{"$f":"Information!D11","v":0},null,{"$f":"Information!D12","v":0},null,{"$f":"Information!D13","v":0},null,{"$f":"Information!D14","v":0},null,{"$f":"Information!D15","v":0},null,{"$f":"Information!D16","v":0},null,{"$f":"Information!D17","v":0},null,"(service center expense paid on another index)",null,"(portion of employee's salary not related to the service center and paid elsewhere)",null,"(should be equal to annual amount column)"]
["Name","Employee V#","PCN","Employee Class **(Staff, Faculty, Student, IH)","Annual Salary","FTE","Fringe Benefits (estimate)","Total Cost","FTE %","Amount","FTE %","Amount","FTE %","Amount","FTE %","Amount","FTE %","Amount","FTE %","Amount","FTE %","Amount","FTE %","Amount","FTE %","Amount","FTE %","Amount","FTE %","Amount","FTE %","Amount","%","Amount"]
["Joe Vandal","V12345678","P11111","Faculty",null,null,{"$f":"IF(E11=0,0,IF(D11=\"Faculty\",((E11*F11)*$M$3),IF(D11=\"Staff\",((E11*F11)*$M$4),IF(D11=\"Student\",((F11*E11)*$M$5),IF(D11=\"IH\",((F11*E11)*$M$6),\"Need Type\")))))","v":0},{"$f":"G11+E11","v":0},null,{"$f":"I11*H11","v":0},null,{"$f":"K11*H11","v":0},null,{"$f":"M11*H11","v":0},null,{"$f":"O11*H11","v":0},null,{"$f":"Q11*H11","v":0},null,{"$f":"S11*H11","v":0},null,{"$f":"U11*H11","v":0},null,{"$f":"W11*H11","v":0},null,{"$f":"Y11*H11","v":0},null,{"$f":"AA11*H11","v":0},null,{"$f":"AC11*$H11","v":0},{"$f":"1-SUMIF(I11:AD11,\"<1.01\",I11:AD11)","v":1},{"$f":"AE11*$H11","v":0},{"$f":"IFERROR(AH11/H11,0)","v":0},{"$f":"SUMIF(I11:AF11,\">1\",I11:AF11)","v":0},{"$f":"IF(AH11<>H11,\"Check allocations\",\"\")","v":""}]
[null,null,null,null,null,null,{"$f":"IF(E12=0,0,IF(D12=\"Faculty\",((E12*F12)*$M$3),IF(D12=\"Staff\",((E12*F12)*$M$4),IF(D12=\"Student\",((F12*E12)*$M$5),IF(D12=\"IH\",((F12*E12)*$M$6),\"Need Type\")))))","v":0},{"$f":"G12+E12","v":0},null,{"$f":"I12*H12","v":0},null,0,null,0,null,{"$f":"O12*H12","v":0},null,{"$f":"Q12*H12","v":0},null,{"$f":"S12*H12","v":0},null,{"$f":"U12*H12","v":0},null,{"$f":"W12*H12","v":0},null,{"$f":"Y12*H12","v":0},null,{"$f":"AA12*H12","v":0},null,{"$f":"AC12*$H12","v":0},1,{"$f":"AE12*$H12","v":0},0,0,""]
[null,null,null,null,null,null,0,{"$f":"G13+E13","v":0},null,{"$f":"I13*H13","v":0},null,0,null,0,null,{"$f":"O13*H13","v":0},null,{"$f":"Q13*H13","v":0},null,{"$f":"S13*H13","v":0},null,{"$f":"U13*H13","v":0},null,{"$f":"W13*H13","v":0},null,{"$f":"Y13*H13","v":0},null,{"$f":"AA13*H13","v":0},null,{"$f":"AC13*$H13","v":0},1,0,0,0,""]
[null,null,null,null,null,null,0,{"$f":"G14+E14","v":0},null,{"$f":"I14*H14","v":0},null,0,null,0,null,{"$f":"O14*H14","v":0},null,{"$f":"Q14*H14","v":0},null,{"$f":"S14*H14","v":0},null,{"$f":"U14*H14","v":0},null,{"$f":"W14*H14","v":0},null,{"$f":"Y14*H14","v":0},null,{"$f":"AA14*H14","v":0},null,0,1,0,0,0,""]
[null,null,null,null,null,null,0,{"$f":"G15+E15","v":0},null,{"$f":"I15*H15","v":0},null,0,null,0,null,{"$f":"O15*H15","v":0},null,{"$f":"Q15*H15","v":0},null,{"$f":"S15*H15","v":0},null,{"$f":"U15*H15","v":0},null,{"$f":"W15*H15","v":0},null,{"$f":"Y15*H15","v":0},null,{"$f":"AA15*H15","v":0},null,{"$f":"AC15*$H15","v":0},1,0,0,0,""]
[null,null,null,null,null,null,0,{"$f":"G16+E16","v":0},null,{"$f":"I16*H16","v":0},null,0,null,0,null,{"$f":"O16*H16","v":0},null,{"$f":"Q16*H16","v":0},null,{"$f":"S16*H16","v":0},null,{"$f":"U16*H16","v":0},null,{"$f":"W16*H16","v":0},null,{"$f":"Y16*H16","v":0},null,{"$f":"AA16*H16","v":0},null,0,1,0,0,0,""]
[null,null,null,null,null,null,0,{"$f":"G17+E17","v":0},null,{"$f":"I17*H17","v":0},null,0,null,0,null,{"$f":"O17*H17","v":0},null,{"$f":"Q17*H17","v":0},null,{"$f":"S17*H17","v":0},null,{"$f":"U17*H17","v":0},null,{"$f":"W17*H17","v":0},null,{"$f":"Y17*H17","v":0},null,{"$f":"AA17*H17","v":0},null,{"$f":"AC17*$H17","v":0},1,0,0,0,""]
[null,null,null,null,null,null,0,{"$f":"G18+E18","v":0},null,{"$f":"I18*H18","v":0},null,0,null,0,null,{"$f":"O18*H18","v":0},null,{"$f":"Q18*H18","v":0},null,{"$f":"S18*H18","v":0},null,{"$f":"U18*H18","v":0},null,{"$f":"W18*H18","v":0},null,{"$f":"Y18*H18","v":0},null,{"$f":"AA18*H18","v":0},null,0,1,0,0,0,""]
[null,null,null,null,null,null,0,{"$f":"G19+E19","v":0},null,{"$f":"I19*H19","v":0},null,0,null,0,null,{"$f":"O19*H19","v":0},null,{"$f":"Q19*H19","v":0},null,{"$f":"S19*H19","v":0},null,{"$f":"U19*H19","v":0},null,{"$f":"W19*H19","v":0},null,{"$f":"Y19*H19","v":0},null,{"$f":"AA19*H19","v":0},null,{"$f":"AC19*$H19","v":0},1,0,0,0,""]
[null,null,null,null,null,null,0,{"$f":"G20+E20","v":0},null,{"$f":"I20*H20","v":0},null,0,null,0,null,{"$f":"O20*H20","v":0},null,{"$f":"Q20*H20","v":0},null,{"$f":"S20*H20","v":0},null,{"$f":"U20*H20","v":0},null,{"$f":"W20*H20","v":0},null,{"$f":"Y20*H20","v":0},null,{"$f":"AA20*H20","v":0},null,0,1,0,0,0,""]
{"$rows_left_out":236}
{"sheet":"Rate Summary","index":7,"n_rows":39,"n_cols":13,"rows_kept":39,"cut":false,"hidden":false,"merged":[[5,1,5,8]]}
[{"$f":"IFERROR('[1]Rate Application'!E6:L6,\"\")","v":""}]
[{"$f":"Information!F4","v":0}]
["Service Center Rate Summary Sheet"]
[{"$f":"'Rate Application'!L1","v":"FY2024"}]
[]
[null,null,null,null,null,null,null,null,null,null,null,"TOTAL"]
[null,{"$f":"Information!B8","v":0},{"$f":"Information!B9","v":0},{"$f":"Information!B10","v":0},{"$f":"Information!B11","v":0},{"$f":"Information!B12","v":0},{"$f":"Information!B13","v":0},{"$f":"Information!B14","v":0},{"$f":"Information!B15","v":0},{"$f":"Information!B16","v":0},{"$f":"Information!B17","v":0},"All Services"]
["Current year rates",{"$f":"IF((ISBLANK(Information!G8)=TRUE),\"N/A\",Information!G8)","v":"N/A"},{"$f":"IF((ISBLANK(Information!$G9)=TRUE),\"N/A\",+Information!$G9)","v":"N/A"},{"$f":"IF((ISBLANK(Information!$G10)=TRUE),\"N/A\",+Information!$G10)","v":"N/A"},{"$f":"IF((ISBLANK(Information!$G11)=TRUE),\"N/A\",+Information!$G11)","v":"N/A"},{"$f":"IF((ISBLANK(Information!$G12)=TRUE),\"N/A\",+Information!$G12)","v":"N/A"},{"$f":"IF((ISBLANK(Information!$G13)=TRUE),\"N/A\",+Information!$G13)","v":"N/A"},{"$f":"IF((ISBLANK(Information!$G14)=TRUE),\"N/A\",+Information!$G14)","v":"N/A"},{"$f":"IF((ISBLANK(Information!$G15)=TRUE),\"N/A\",+Information!$G15)","v":"N/A"},{"$f":"IF((ISBLANK(Information!$G16)=TRUE),\"N/A\",+Information!$G16)","v":"N/A"},{"$f":"IF((ISBLANK(Information!$G17)=TRUE),\"N/A\",+Information!$G17)","v":"N/A"},"(not include subsidy)"]
["Prior Year Fund Balance (if applicable)",{"$f":"IFERROR((Information!$F$5*'Rate Summary'!B33),0)","v":0},{"$f":"IFERROR((Information!$F$5*'Rate Summary'!C33),0)","v":0},{"$f":"IFERROR((Information!$F$5*'Rate Summary'!D33),0)","v":0},{"$f":"IFERROR((Information!$F$5*'Rate Summary'!E33),0)","v":0},{"$f":"IFERROR((Information!$F$5*'Rate Summary'!F33),0)","v":0},{"$f":"IFERROR((Information!$F$5*'Rate Summary'!G33),0)","v":0},{"$f":"IFERROR((Information!$F$5*'Rate Summary'!H33),0)","v":0},{"$f":"IFERROR((Information!$F$5*'Rate Summary'!I33),0)","v":0},{"$f":"IFERROR((Information!$F$5*'Rate Summary'!J33),0)","v":0},{"$f":"IFERROR((Information!$F$5*'Rate Summary'!K33),0)","v":0},{"$f":"SUM(B9:K9)","v":0}]
[]
["ANNUAL COSTS"]
["Salaries and Fringe Benefits",{"$f":"'Salary Operating and Deprec Exp'!J44","v":0},{"$f":"'Salary Operating and Deprec Exp'!L44","v":0},{"$f":"'Salary Operating and Deprec Exp'!N44","v":0},{"$f":"'Salary Operating and Deprec Exp'!P44","v":0},{"$f":"'Salary Operating and Deprec Exp'!R44","v":0},{"$f":"'Salary Operating and Deprec Exp'!T44","v":0},{"$f":"'Salary Operating and Deprec Exp'!V44","v":0},{"$f":"'Salary Operating and Deprec Exp'!X44","v":0},{"$f":"'Salary Operating and Deprec Exp'!Z44","v":0},{"$f":"'Salary Operating and Deprec Exp'!AB44","v":0},{"$f":"SUM(B12:K12)","v":0}]
["Operating Costs",{"$f":"'Salary Operating and Deprec Exp'!D125","v":0},{"$f":"'Salary Operating and Deprec Exp'!F125","v":0},{"$f":"'Salary Operating and Deprec Exp'!H125","v":0},{"$f":"'Salary Operating and Deprec Exp'!J125","v":0},{"$f":"'Salary Operating and Deprec Exp'!L125","v":0},{"$f":"'Salary Operating and Deprec Exp'!N125","v":0},{"$f":"'Salary Operating and Deprec Exp'!P125","v":0},{"$f":"'Salary Operating and Deprec Exp'!R125","v":0},{"$f":"'Salary Operating and Deprec Exp'!T125","v":0},{"$f":"'Salary Operating and Deprec Exp'!V125","v":0},{"$f":"SUM(B13:K13)","v":0}]
["Capital equipment depreciation",{"$f":"'Salary Operating and Deprec Exp'!K251","v":0},{"$f":"'Salary Operating and Deprec Exp'!M251","v":0},{"$f":"'Salary Operating and Deprec Exp'!O251","v":0},{"$f":"'Salary Operating and Deprec Exp'!Q251","v":0},{"$f":"'Salary Operating and Deprec Exp'!S251","v":0},{"$f":"'Salary Operating and Deprec Exp'!U251","v":0},{"$f":"'Salary Operating and Deprec Exp'!W251","v":0},{"$f":"'Salary Operating and Deprec Exp'!Y251","v":0},{"$f":"'Salary Operating and Deprec Exp'!AA251","v":0},{"$f":"'Salary Operating and Deprec Exp'!AC251","v":0},{"$f":"SUM(B14:K14)","v":0}]
[null,null,null,null,null,null,null,null,null,null,null,null,"Annual costs totals check"]
["SUBTOTAL ANNUAL SERVICE COSTS",{"$f":"SUM(B12:B15)","v":0},0,0,0,0,0,0,0,0,0,{"$f":"SUM(B16:K16)","v":0},{"$f":"ROUND((-$L$16+'Salary Operating and Deprec Exp'!AI253+'Salary Operating and Deprec Exp'!Z127+'Salary Operating and Deprec Exp'!AH46),0)","v":0}]
[]
["Estimated 2 months working capital",{"$f":"B16*0.166","v":0},{"$f":"C16*0.166","v":0},0,0,0,0,0,0,0,0,{"$f":"SUM(B18:K18)","v":0}]
[]
["TOTAL ANNUAL SERVICE COSTS (includes working capital)",{"$f":"B16+B18","v":0},{"$f":"C16+C18","v":0},0,0,0,0,0,0,0,0,{"$f":"SUM(B20:K20)","v":0}]
{"$rows_left_out":20}
{"sheet":"Rate Sheet","index":8,"n_rows":30,"n_cols":5,"rows_kept":30,"cut":false,"hidden":false,"merged":[[4,0,4,4],[1,0,1,4],[2,0,2,4],[3,0,3,4]]}
[]
["Service Center Billing Rates"]
[{"$f":"'Rate Application'!L1","v":"FY2024"}]
[{"$f":"'Rate Application'!E6","v":0}]
[{"$f":"Information!F4","v":0}]
[]
["Service ","Description","Unit"," Internal Rate","External Rate"]
[{"$f":"Information!B8","v":0},{"$f":"Information!G8","v":0},{"$f":"Information!H8","v":0},{"$f":"Information!J8","v":0},{"$f":"IFERROR('Rate Summary'!B39,\"N/A\")","v":0}]
[{"$f":"Information!B9","v":0},{"$f":"Information!D9","v":0},{"$f":"Information!H9","v":0},{"$f":"Information!J9","v":0},{"$f":"IFERROR('Rate Summary'!C39,\"N/A\")","v":0}]
[{"$f":"Information!B10","v":0},{"$f":"Information!D10","v":0},{"$f":"Information!H10","v":0},{"$f":"Information!J10","v":0},{"$f":"IFERROR('Rate Summary'!D39,\"N/A\")","v":0}]
[{"$f":"Information!B11","v":0},{"$f":"Information!D11","v":0},{"$f":"Information!H11","v":0},{"$f":"Information!J11","v":0},{"$f":"IFERROR('Rate Summary'!E39,\"N/A\")","v":0}]
[{"$f":"Information!B12","v":0},{"$f":"Information!D12","v":0},{"$f":"Information!H12","v":0},{"$f":"Information!J12","v":0},{"$f":"IFERROR('Rate Summary'!F39,\"N/A\")","v":0}]
[{"$f":"Information!B13","v":0},{"$f":"Information!D13","v":0},{"$f":"Information!H13","v":0},{"$f":"Information!J13","v":0},{"$f":"IFERROR('Rate Summary'!G39,\"N/A\")","v":0}]
[{"$f":"Information!B14","v":0},{"$f":"Information!D14","v":0},{"$f":"Information!H14","v":0},{"$f":"Information!J14","v":0},{"$f":"IFERROR('Rate Summary'!H39,\"N/A\")","v":0}]
[{"$f":"Information!B15","v":0},{"$f":"Information!D15","v":0},{"$f":"Information!H15","v":0},{"$f":"Information!J15","v":0},{"$f":"IFERROR('Rate Summary'!I39,\"N/A\")","v":0}]
[{"$f":"Information!B16","v":0},{"$f":"Information!D16","v":0},{"$f":"Information!H16","v":0},{"$f":"Information!J16","v":0},{"$f":"IFERROR('Rate Summary'!J39,\"N/A\")","v":0}]
[{"$f":"Information!B17","v":0},{"$f":"Information!D17","v":0},{"$f":"Information!H17","v":0},{"$f":"Information!J17","v":0},{"$f":"IFERROR('Rate Summary'!K39,\"N/A\")","v":0}]
[]
[]
[]
{"$rows_left_out":11}
{"sheet":"Index Summary","index":9,"n_rows":31,"n_cols":8,"rows_kept":31,"cut":false,"hidden":false,"merged":[[0,0,0,3],[2,0,2,3],[5,0,5,3],[5,5,5,8],[1,0,1,3]]}
[{"$f":"'Rate Application'!E7&\" Index Summary\"","v":" Index Summary"}]
[{"$f":"Information!E3","v":"Please fill in cell E6 on rate application page"}]
[{"$f":"Information!J1","v":"FY2024"}]
[]
[]
[{"$f":"Information!B23&\" \"&Information!D23","v":" "},null,null,null,null,{"$f":"Information!B31&\" \"&Information!C31","v":"  "}]
["Projected Operating Index",null,null,null,null,"Projected Capital Equip Replacement Index"]
[]
["Revenue",null,null,null,null,"Depreciation"]
[null,{"$f":"+Information!B8","v":0},{"$f":"IFERROR(('Rate Summary'!B31*'Rate Summary'!B26),0)","v":0},null,null,null,"Transfer from operating index **",{"$f":"C25","v":0}]
[null,{"$f":"+Information!B9","v":0},{"$f":"IFERROR(('Rate Summary'!C31*'Rate Summary'!C26),0)","v":0},null,null,null,"Prior year carryover",{"$f":"Information!J31","v":0}]
[null,{"$f":"+Information!B10","v":0},{"$f":"IFERROR(('Rate Summary'!D$31*'Rate Summary'!D$26),0)","v":0}]
[null,{"$f":"+Information!B11","v":0},{"$f":"IFERROR(('Rate Summary'!E$31*'Rate Summary'!E$26),0)","v":0},null,null,"Total Accumulated Depreciation",null,{"$f":"SUM(H10:H12)","v":0}]
[null,{"$f":"+Information!B12","v":0},{"$f":"IFERROR(('Rate Summary'!F$31*'Rate Summary'!F$26),0)","v":0}]
[null,{"$f":"+Information!B13","v":0},{"$f":"IFERROR(('Rate Summary'!G$31*'Rate Summary'!G$26),0)","v":0},null,null,"Expenditures"]
[null,{"$f":"+Information!B14","v":0},{"$f":"IFERROR(('Rate Summary'!H$31*'Rate Summary'!H$26),0)","v":0},null,null,null,"Capital Outlay > $5,000 *"]
[null,{"$f":"+Information!B15","v":0},{"$f":"IFERROR(('Rate Summary'!I$31*'Rate Summary'!I$26),0)","v":0}]
[null,{"$f":"+Information!B16","v":0},{"$f":"IFERROR(('Rate Summary'!J$31*'Rate Summary'!J$26),0)","v":0}]
[null,{"$f":"+Information!B17","v":0},{"$f":"IFERROR(('Rate Summary'!K$31*'Rate Summary'!K$26),0)","v":0}]
[null,null,{"$f":"SUM(C10:C19)","v":0}]
{"$rows_left_out":12}
{"sheet":"Reviewer Notes","index":10,"n_rows":30,"n_cols":6,"rows_kept":30,"cut":false,"hidden":false,"merged":[[36,1,36,4],[37,1,37,4],[30,1,30,4],[31,1,31,4],[32,1,32,4],[33,1,33,4],[34,1,34,4],[35,1,35,4]]}
["Service Center Reviewer Notes"]
[null,null,null,"Recommend approval","Recommend        Rework"]
["Date"]
["Reviewer"]
[]
[]
[null,"Fund",{"$f":"Information!B23","v":0},{"$f":"Information!C23","v":0}]
[]
[null,"Fund Balance",{"$f":"\"FY\"&RIGHT('Rate Application'!L1,2)-1","v":"FY23"},{"$f":"\"FY\"&ABS(RIGHT(C9,2)-1)","v":"FY22"},{"$f":"\"FY\"&ABS(RIGHT(D9,2)-1)","v":"FY21"}]
[null,"Beg Balance"]
[null,"Revenues"]
[null,"Expenditures"]
[null,"Encumbrances"]
[null,"Transfers Out"]
[]
[null,"Ending Balance",{"$f":"C10+C11-C12-C13-C14","v":0},{"$f":"D10+D11-D12-D13-D14","v":0},0]
[]
[null,"Fund",{"$f":"Information!B31","v":0},{"$f":"Information!#REF!","v":{"$error":"#REF!"}}]
[]
[null,"Fund Balance",{"$f":"\"FY\"&RIGHT('Rate Application'!L1,2)-1","v":"FY23"},{"$f":"\"FY\"&ABS(RIGHT(C20,2)-1)","v":"FY22"},{"$f":"\"FY\"&ABS(RIGHT(D20,2)-1)","v":"FY21"}]
{"$rows_left_out":10}